Target
5-hydroxytryptamine receptor 1A
Ligand
BDBM458551
Substrate
Meas. Tech.
Binding Affinity Assay
Ki
0.190±n/a nM
Citation
 Yoshinaga, HIkuma, YIkeda, JAdachi, SMitsunuma, HAihara, YBesnard, JBell, AS Substituted lactams showing serotonin 5-HT receptor activity US Patent  US11466007 Publication Date 10/11/2022 
Target
Name:
5-hydroxytryptamine receptor 1A
Synonyms:
5-HT-1A 5-hydroxytryptamine receptor 1A (5-HT-1A) ADRB2RL1 Dopamine D2 receptor and serotonin 1a receptor HTR1A | Serotonin receptor 1A
Type:
Mol. Mass.:
46122.49
Organism:
Homo sapiens (Human)
Description:
Residue:
422
  
Inhibitor
Name:
BDBM458551
Synonyms:
US10745401, Example 25 | US11466007, Example 25
Type:
Small organic molecule
Emp. Form.:
C22H24N4OS
Mol. Mass.:
392.517
SMILES:
O=C1C(CCN2CCN(CC2)c2nsc3ccccc23)CCc2cccnc12
: