Target
5-hydroxytryptamine receptor 2A
Ligand
BDBM458555
Substrate
Meas. Tech.
Binding Affinity Assay
Ki
0.230±n/a nM
Citation
 Yoshinaga, HIkuma, YIkeda, JAdachi, SMitsunuma, HAihara, YBesnard, JBell, AS Substituted lactams showing serotonin 5-HT receptor activity US Patent  US11466007 Publication Date 10/11/2022 
Target
Name:
5-hydroxytryptamine receptor 2A
Synonyms:
5-HT-2 5-HT2A 5-hydroxytryptamine receptor 2A (5HT-2A) 5HT2A_HUMAN HTR2A | Serotonin receptor 2A
Type:
undefined
Mol. Mass.:
52607.65
Organism:
Homo sapiens (Human)
Description:
P28223
Residue:
471
  
Inhibitor
Name:
BDBM458555
Synonyms:
US10745401, Example 29 | US11466007, Example 29
Type:
Small organic molecule
Emp. Form.:
C21H25N5OS
Mol. Mass.:
395.521
SMILES:
Cn1ncc2c1CCC(CCN1CCN(CC1)c1nsc3ccccc13)C2=O
: