Target
5-hydroxytryptamine receptor 1A
Ligand
BDBM458628
Substrate
Meas. Tech.
Binding Affinity Assay
Ki
0.250±n/a nM
Citation
 Yoshinaga, HIkuma, YIkeda, JAdachi, SMitsunuma, HAihara, YBesnard, JBell, AS Substituted lactams showing serotonin 5-HT receptor activity US Patent  US11466007 Publication Date 10/11/2022 
Target
Name:
5-hydroxytryptamine receptor 1A
Synonyms:
5-HT-1A 5-hydroxytryptamine receptor 1A (5-HT-1A) ADRB2RL1 Dopamine D2 receptor and serotonin 1a receptor HTR1A | Serotonin receptor 1A
Type:
Mol. Mass.:
46122.49
Organism:
Homo sapiens (Human)
Description:
Residue:
422
  
Inhibitor
Name:
BDBM458628
Synonyms:
7-{2-[4-(1,2-Benzoisothiazol-3-yl)piperazin-1-yl]ethyl}-8-oxo-5,6,7,8-tetrahydro-2,7-naphthyridine-3-carbonitrile US11466007, Example 102
Type:
Small organic molecule
Emp. Form.:
C22H22N6OS
Mol. Mass.:
418.515
SMILES:
O=C1N(CCN2CCN(CC2)c2nsc3ccccc23)CCc2cc(ncc12)C#N
: