Target
5-hydroxytryptamine receptor 2A
Ligand
BDBM458530
Substrate
Meas. Tech.
Binding Affinity Assay
Ki
0.270±n/a nM
Citation
 Yoshinaga, HIkuma, YIkeda, JAdachi, SMitsunuma, HAihara, YBesnard, JBell, AS Substituted lactams showing serotonin 5-HT receptor activity US Patent  US11466007 Publication Date 10/11/2022 
Target
Name:
5-hydroxytryptamine receptor 2A
Synonyms:
5-HT-2 5-HT2A 5-hydroxytryptamine receptor 2A (5HT-2A) 5HT2A_HUMAN HTR2A | Serotonin receptor 2A
Type:
undefined
Mol. Mass.:
52607.65
Organism:
Homo sapiens (Human)
Description:
P28223
Residue:
471
  
Inhibitor
Name:
BDBM458530
Synonyms:
US10745401, Example 125 US11466007, Example 125
Type:
Small organic molecule
Emp. Form.:
C22H23FN4O2
Mol. Mass.:
394.442
SMILES:
Fc1ccc2c(noc2c1)C1CCN(CCN2CCc3cccnc3C2=O)CC1
: