Target
5-hydroxytryptamine receptor 2A
Ligand
BDBM458695
Substrate
Meas. Tech.
Binding Affinity Assay
Ki
0.180±n/a nM
Citation
 Yoshinaga, HIkuma, YIkeda, JAdachi, SMitsunuma, HAihara, YBesnard, JBell, AS Substituted lactams showing serotonin 5-HT receptor activity US Patent  US11466007 Publication Date 10/11/2022 
Target
Name:
5-hydroxytryptamine receptor 2A
Synonyms:
5-HT-2 5-HT2A 5-hydroxytryptamine receptor 2A (5HT-2A) 5HT2A_HUMAN HTR2A | Serotonin receptor 2A
Type:
undefined
Mol. Mass.:
52607.65
Organism:
Homo sapiens (Human)
Description:
P28223
Residue:
471
  
Inhibitor
Name:
BDBM458695
Synonyms:
US10745401, Example 168 | US11466007, Example 168
Type:
Small organic molecule
Emp. Form.:
C25H26N6OS
Mol. Mass.:
458.579
SMILES:
O=C1N(CCN2CCN(CC2)c2nsc3ccccc23)CCc2nn(cc12)-c1ccccc1
: