Target
Non-receptor tyrosine-protein kinase TYK2
Ligand
BDBM305824
Substrate
Meas. Tech.
JAK Caliper Enzyme Assay at 1 mM ATP
IC50
9.00±n/a nM
Citation
 Brown, MFDermenci, AFensome, AGerstenberger, BSHayward, MMOwen, DRWright, SWXing, LHYang, X Pyrazolo[1,5-a]pyrazin-4-yl derivatives US Patent  US11472809 Publication Date 10/18/2022 
Target
Name:
Non-receptor tyrosine-protein kinase TYK2
Synonyms:
Non-receptor tyrosine-protein kinase TYK2 (TYK2) TYK2_HUMAN | Tyrosine-protein kinase TYK2
Type:
Protein
Mol. Mass.:
133666.03
Organism:
Homo sapiens (Human)
Description:
P29597
Residue:
1187
  
Inhibitor
Name:
BDBM305824
Synonyms:
(1r,3r)-3-(4-(6-(3-Amino-1-methyl-1H-pyrazol-4-yl)pyrazolo[1,5-a]pyrazin-4-yl)-1H-pyrazol-1-yl)-3-(cyanomethyl)cyclobutane-1-carbonitrile US10822341, Example 23 | US11472809, Example 23
Type:
Small organic molecule
Emp. Form.:
C20H18N10
Mol. Mass.:
398.4239
SMILES:
Cn1cc(c(N)n1)-c1cn2nccc2c(n1)-c1cnn(c1)[C@@]1(CC#N)C[C@@H](C1)C#N
: