Target
C5a anaphylatoxin chemotactic receptor 1
Ligand
BDBM577772
Substrate
Meas. Tech.
chemotaxis assay
IC50
<5±n/a nM
Citation
 Fan, PLange, CWMalathong, VMali, VRPunna, STanaka, HZeng, YZhang, P Diaryl substituted 6,5-fused ring compounds as C5aR inhibitors US Patent  US11478460 Publication Date 10/25/2022 
Target
Name:
C5a anaphylatoxin chemotactic receptor 1
Synonyms:
C5AR C5AR1_HUMAN C5a anaphylatoxin chemotactic receptor C5a-R | CD_antigen=CD88
Type:
Enzyme
Mol. Mass.:
39347.68
Organism:
Homo sapiens (Human)
Description:
P21730
Residue:
350
  
Inhibitor
Name:
BDBM577772
Synonyms:
US11478460, Compound 1.112
Type:
Small organic molecule
Emp. Form.:
C25H20Cl2F2N4O
Mol. Mass.:
501.355
SMILES:
Cc1cccc(C)c1-n1nc2CCN(Cc2c1-c1cc(F)c(O)cc1F)c1ncc(Cl)cc1Cl
: