Target
C5a anaphylatoxin chemotactic receptor 1
Ligand
BDBM577814
Substrate
Meas. Tech.
chemotaxis assay
IC50
<5±n/a nM
Citation
 Fan, PLange, CWMalathong, VMali, VRPunna, STanaka, HZeng, YZhang, P Diaryl substituted 6,5-fused ring compounds as C5aR inhibitors US Patent  US11478460 Publication Date 10/25/2022 
Target
Name:
C5a anaphylatoxin chemotactic receptor 1
Synonyms:
C5AR C5AR1_HUMAN C5a anaphylatoxin chemotactic receptor C5a-R | CD_antigen=CD88
Type:
Enzyme
Mol. Mass.:
39347.68
Organism:
Homo sapiens (Human)
Description:
P21730
Residue:
350
  
Inhibitor
Name:
BDBM577814
Synonyms:
US11478460, Compound 1.154
Type:
Small organic molecule
Emp. Form.:
C26H22F5N7O
Mol. Mass.:
543.4912
SMILES:
Cc1cccc(C)c1-n1nc2CCN(Cc2c1-c1cc(F)c(NC(N)=O)cc1F)c1ncc(cn1)C(F)(F)F
: