Target
C5a anaphylatoxin chemotactic receptor 1
Ligand
BDBM577822
Substrate
Meas. Tech.
chemotaxis assay
IC50
<5±n/a nM
Citation
 Fan, PLange, CWMalathong, VMali, VRPunna, STanaka, HZeng, YZhang, P Diaryl substituted 6,5-fused ring compounds as C5aR inhibitors US Patent  US11478460 Publication Date 10/25/2022 
Target
Name:
C5a anaphylatoxin chemotactic receptor 1
Synonyms:
C5AR C5AR1_HUMAN C5a anaphylatoxin chemotactic receptor C5a-R | CD_antigen=CD88
Type:
Enzyme
Mol. Mass.:
39347.68
Organism:
Homo sapiens (Human)
Description:
P21730
Residue:
350
  
Inhibitor
Name:
BDBM577822
Synonyms:
US11478460, Compound 1.162
Type:
Small organic molecule
Emp. Form.:
C32H35F2N5O
Mol. Mass.:
543.65
SMILES:
CCC(N1CCc2nn(c(c2C1)-c1cc(F)c(NC(N)=O)cc1F)-c1c(CC)cccc1CC)c1ccccc1
: