Target
Ataxin-1
Ligand
BDBM50557594
Substrate
Meas. Tech.
Biochemical ATX Assa
IC50
1.50±n/a nM
Citation
 Kuttruff, CABretschneider, TGodbout, CKoolman, HFMartyres, DRoth, GJ N-methyl, n-(6-(methoxy)pyridazin-3-yl) amine derivatives as autotaxin (ATX) modulators US Patent  US11485727 Publication Date 11/1/2022 
Target
Name:
Ataxin-1
Synonyms:
ATX1 ATXN1 | SCA1
Type:
Protein
Mol. Mass.:
86941.25
Organism:
Homo sapiens (Human)
Description:
P54253
Residue:
815
  
Inhibitor
Name:
BDBM50557594
Synonyms:
CHEMBL4788435 | US11485727, Example 1.3
Type:
Small organic molecule
Emp. Form.:
C24H25F3N6O2
Mol. Mass.:
486.4895
SMILES:
CC(=O)N1CCN(CC1)c1ccc(CNc2ccc(OCc3ccc(nc3)C(F)F)nn2)cc1F
: