Target
Ataxin-1
Ligand
BDBM50557595
Substrate
Meas. Tech.
Biochemical ATX Assa
IC50
1.60±n/a nM
Citation
 Kuttruff, CABretschneider, TGodbout, CKoolman, HFMartyres, DRoth, GJ N-methyl, n-(6-(methoxy)pyridazin-3-yl) amine derivatives as autotaxin (ATX) modulators US Patent  US11485727 Publication Date 11/1/2022 
Target
Name:
Ataxin-1
Synonyms:
ATX1 ATXN1 | SCA1
Type:
Protein
Mol. Mass.:
86941.25
Organism:
Homo sapiens (Human)
Description:
P54253
Residue:
815
  
Inhibitor
Name:
BDBM50557595
Synonyms:
CHEMBL4745566 | US11485727, Example 1.7
Type:
Small organic molecule
Emp. Form.:
C26H30F2N6O2
Mol. Mass.:
496.5522
SMILES:
CC(=O)N1CCN(CC1(C)C)c1ccc(CNc2ccc(OCc3ccc(nc3)C(F)F)nn2)cc1
: