Target
Ataxin-1
Ligand
BDBM50557597
Substrate
Meas. Tech.
Biochemical ATX Assa
IC50
1.80±n/a nM
Citation
 Kuttruff, CABretschneider, TGodbout, CKoolman, HFMartyres, DRoth, GJ N-methyl, n-(6-(methoxy)pyridazin-3-yl) amine derivatives as autotaxin (ATX) modulators US Patent  US11485727 Publication Date 11/1/2022 
Target
Name:
Ataxin-1
Synonyms:
ATX1 ATXN1 | SCA1
Type:
Protein
Mol. Mass.:
86941.25
Organism:
Homo sapiens (Human)
Description:
P54253
Residue:
815
  
Inhibitor
Name:
BDBM50557597
Synonyms:
CHEMBL4758133 | US11485727, Example 2.6
Type:
Small organic molecule
Emp. Form.:
C25H26F2N6O2
Mol. Mass.:
480.5097
SMILES:
CC(=O)N1CC2CC1CN2c1ccc(CNc2ccc(OCc3ccc(nc3)C(F)F)nn2)cc1
: