Target
Ataxin-1
Ligand
BDBM50557599
Substrate
Meas. Tech.
Biochemical ATX Assa
IC50
1.80±n/a nM
Citation
 Kuttruff, CABretschneider, TGodbout, CKoolman, HFMartyres, DRoth, GJ N-methyl, n-(6-(methoxy)pyridazin-3-yl) amine derivatives as autotaxin (ATX) modulators US Patent  US11485727 Publication Date 11/1/2022 
Target
Name:
Ataxin-1
Synonyms:
ATX1 ATXN1 | SCA1
Type:
Protein
Mol. Mass.:
86941.25
Organism:
Homo sapiens (Human)
Description:
P54253
Residue:
815
  
Inhibitor
Name:
BDBM50557599
Synonyms:
CHEMBL4751395 | US11485727, Example 2.10
Type:
Small organic molecule
Emp. Form.:
C25H28F2N6O2
Mol. Mass.:
482.5256
SMILES:
FC(F)c1ccc(COc2ccc(NCc3ccc(cc3)N3CCN(CC3)C3COC3)nn2)cn1
: