Target
Histone-binding protein RBBP4/Polycomb protein EED/Polycomb protein SUZ12/Zinc finger protein AEBP2
Ligand
BDBM513639
Substrate
Meas. Tech.
Enzymatic Activity Assay
IC50
<100±n/a nM
Citation
 Marx, MALee, MRBobinski, TPBurns, ACArora, NChristensen, JGKetcham, JM Substituted imidazo[1,2-c]pyrimidines as PRC2 inhibitors US Patent  US11485738 Publication Date 11/1/2022 
Target
Name:
Histone-binding protein RBBP4/Polycomb protein EED/Polycomb protein SUZ12/Zinc finger protein AEBP2
Synonyms:
Human PRC2 complex
Type:
Protein
Mol. Mass.:
Description:
Components:
This complex has 5 components.
Component 1
Name:
Polycomb protein EED
Synonyms:
EED WAIT-1 hEED
Type:
Protein
Mol. Mass.:
50201.68
Organism:
Homo sapiens (Human)
Description:
O75530
Residue:
441
  
Component 2
Name:
Polycomb protein SUZ12
Synonyms:
CHET9 Chromatin precipitated E2F target 9 protein Joined to JAZF1 protein Polycomb protein SUZ12 SUZ12 Suppressor of zeste 12 protein homolog
Type:
Protein
Mol. Mass.:
83080.09
Organism:
Homo sapiens (Human)
Description:
Q15022
Residue:
739
  
Component 3
Name:
Histone-binding protein RBBP4
Synonyms:
RBAP48 RBBP4_HUMAN | Retinoblastoma-binding protein p48 (RBAP48)
Type:
Protein
Mol. Mass.:
47627.91
Organism:
Homo sapiens (Human)
Description:
Q09028
Residue:
425
  
Component 4
Name:
Zinc finger protein AEBP2
Synonyms:
AEBP2 Adipocyte enhancer-binding protein 2 (AEBP2) | Zinc finger protein AEBP2
Type:
Protein
Mol. Mass.:
54448.84
Organism:
Homo sapiens (Human)
Description:
Q6ZN18
Residue:
517
  
Inhibitor
Name:
BDBM513639
Synonyms:
5-(((5-fluoro-2,3-dihydrobenzofuran-4-yl)methyl)amino)-8-(2-methylpyridin-3-yl)imidazo[1,2-c]pyrimidine-2-carboxylic acid US11485738, Example 2
Type:
Small organic molecule
Emp. Form.:
C22H18FN5O3
Mol. Mass.:
419.4084
SMILES:
Cc1ncccc1-c1cnc(NCc2c3CCOc3ccc2F)n2cc(nc12)C(O)=O
: