Target
Histone acetyltransferase KAT5
Ligand
BDBM580667
Substrate
Meas. Tech.
Kat5 Assay
Ki
4530±n/a nM
Citation
 Bozikis, YECamerino, MAKung, PStupple, PASutton, SC Benzisoxazole sulfonamide derivatives US Patent  US11492346 Publication Date 11/8/2022 
Target
Name:
Histone acetyltransferase KAT5
Synonyms:
HTATIP KAT5_HUMAN | TIP60
Type:
PROTEIN
Mol. Mass.:
58595.98
Organism:
Homo sapiens (Human)
Description:
ChEMBL_796787
Residue:
513
  
Inhibitor
Name:
BDBM580667
Synonyms:
US11492346, Example 7
Type:
Small organic molecule
Emp. Form.:
C20H19FN4O6S
Mol. Mass.:
462.451
SMILES:
COc1cccc(OC)c1S(=O)(=O)Nc1noc2cc(Cn3cc(F)cn3)cc(OC)c12
: