Target
Histone acetyltransferase KAT5
Ligand
BDBM580681
Substrate
Meas. Tech.
Kat5 Assay
Ki
1030±n/a nM
Citation
 Bozikis, YECamerino, MAKung, PStupple, PASutton, SC Benzisoxazole sulfonamide derivatives US Patent  US11492346 Publication Date 11/8/2022 
Target
Name:
Histone acetyltransferase KAT5
Synonyms:
HTATIP KAT5_HUMAN | TIP60
Type:
PROTEIN
Mol. Mass.:
58595.98
Organism:
Homo sapiens (Human)
Description:
ChEMBL_796787
Residue:
513
  
Inhibitor
Name:
BDBM580681
Synonyms:
US11492346, Example 21
Type:
Small organic molecule
Emp. Form.:
C23H24N4O5S
Mol. Mass.:
468.525
SMILES:
COc1ccc2CCCCc2c1S(=O)(=O)Nc1noc2cc(Cn3cccn3)cc(OC)c12
: