Target
Histone acetyltransferase KAT5
Ligand
BDBM580732
Substrate
Meas. Tech.
Kat5 Assay
Ki
2960±n/a nM
Citation
 Bozikis, YECamerino, MAKung, PStupple, PASutton, SC Benzisoxazole sulfonamide derivatives US Patent  US11492346 Publication Date 11/8/2022 
Target
Name:
Histone acetyltransferase KAT5
Synonyms:
HTATIP KAT5_HUMAN | TIP60
Type:
PROTEIN
Mol. Mass.:
58595.98
Organism:
Homo sapiens (Human)
Description:
ChEMBL_796787
Residue:
513
  
Inhibitor
Name:
BDBM580732
Synonyms:
US11492346, Example 72
Type:
Small organic molecule
Emp. Form.:
C20H20N4O4S
Mol. Mass.:
412.462
SMILES:
COc1cc(Cn2cccn2)cc2onc(NS(=O)(=O)c3ccc(C)c(C)c3)c12
: