Target
Histone acetyltransferase KAT5
Ligand
BDBM580739
Substrate
Meas. Tech.
Kat5 Assay
Ki
1440±n/a nM
Citation
 Bozikis, YECamerino, MAKung, PStupple, PASutton, SC Benzisoxazole sulfonamide derivatives US Patent  US11492346 Publication Date 11/8/2022 
Target
Name:
Histone acetyltransferase KAT5
Synonyms:
HTATIP KAT5_HUMAN | TIP60
Type:
PROTEIN
Mol. Mass.:
58595.98
Organism:
Homo sapiens (Human)
Description:
ChEMBL_796787
Residue:
513
  
Inhibitor
Name:
BDBM580739
Synonyms:
US11492346, Example 79
Type:
Small organic molecule
Emp. Form.:
C19H17FN4O4S
Mol. Mass.:
416.426
SMILES:
COc1cc(Cn2cccn2)cc2onc(NS(=O)(=O)c3ccc(C)c(F)c3)c12
: