Target
Monoglyceride lipase
Ligand
BDBM581607
Substrate
Meas. Tech.
Biological Assay
IC50
0.820±n/a nM
Citation
 Alcazar, JAmeriks, MKBerry, CBGarcia-Reynaga, PSamant, AVVega-Ramiro, JA Azaspirocycles as monoacylglycerol lipase modulators US Patent  US11505546 Publication Date 11/22/2022 
Target
Name:
Monoglyceride lipase
Synonyms:
HU-K5 Lysophospholipase-like MGL MGLL_HUMAN
Type:
Hydrolase
Mol. Mass.:
33264.56
Organism:
Homo sapiens (Human)
Description:
Human recombinant MGL (Cayman Chemical, cat# 10008354).
Residue:
303
  
Inhibitor
Name:
BDBM581607
Synonyms:
(2r,4s)-2-(2-(5-(tert-Butyl)-2-fluorophenyl)-7-azaspiro[3.5]nonane-7-carbonyl)-5- azaspiro[3.4]octan-6-one | US11505546, Example 22
Type:
Small organic molecule
Emp. Form.:
C25H33FN2O3
Mol. Mass.:
428.5395
SMILES:
CC(C)(C)c1ccc(F)c(c1)C1CC2(C1)CCN(CC2)C(=O)[C@H]1C[C@@]2(C1)COC(=O)N2
: