Target
Monoglyceride lipase
Ligand
BDBM581636
Substrate
Meas. Tech.
Biological Assay
IC50
1.000±n/a nM
Citation
 Alcazar, JAmeriks, MKBerry, CBGarcia-Reynaga, PSamant, AVVega-Ramiro, JA Azaspirocycles as monoacylglycerol lipase modulators US Patent  US11505546 Publication Date 11/22/2022 
Target
Name:
Monoglyceride lipase
Synonyms:
HU-K5 Lysophospholipase-like MGL MGLL_HUMAN
Type:
Hydrolase
Mol. Mass.:
33264.56
Organism:
Homo sapiens (Human)
Description:
Human recombinant MGL (Cayman Chemical, cat# 10008354).
Residue:
303
  
Inhibitor
Name:
BDBM581636
Synonyms:
(rac)-(2s,4s)-2-(6-(3-(tert-Butyl)phenyl)-2-azaspiro[3.4]octane-2-carbonyl)-8- methyl-7-oxa-5 -azaspiro[3.4] octan-6-one | US11505546, Example 51
Type:
Small organic molecule
Emp. Form.:
C25H34N2O3
Mol. Mass.:
410.5491
SMILES:
CC1OC(=O)N[C@@]11C[C@@H](C1)C(=O)N1CC2(C1)CCC(C2)c1cccc(c1)C(C)(C)C
: