Target
Monoglyceride lipase
Ligand
BDBM581646
Substrate
Meas. Tech.
Biological Assay
IC50
0.170±n/a nM
Citation
 Alcazar, JAmeriks, MKBerry, CBGarcia-Reynaga, PSamant, AVVega-Ramiro, JA Azaspirocycles as monoacylglycerol lipase modulators US Patent  US11505546 Publication Date 11/22/2022 
Target
Name:
Monoglyceride lipase
Synonyms:
HU-K5 Lysophospholipase-like MGL MGLL_HUMAN
Type:
Hydrolase
Mol. Mass.:
33264.56
Organism:
Homo sapiens (Human)
Description:
Human recombinant MGL (Cayman Chemical, cat# 10008354).
Residue:
303
  
Inhibitor
Name:
BDBM581646
Synonyms:
(rac)-(2s,4s)-2-(6-(3-Isopropylphenyl)-2-azaspiro[3.4]octane-2-carbonyl)-7-oxa-5- azaspiro[3.4]octan-6-one | US11505546, Example 61
Type:
Small organic molecule
Emp. Form.:
C23H30N2O3
Mol. Mass.:
382.4959
SMILES:
CC(C)c1cccc(c1)C1CCC2(CN(C2)C(=O)[C@H]2C[C@@]3(C2)COC(=O)N3)C1
: