Target
Monoglyceride lipase
Ligand
BDBM581654
Substrate
Meas. Tech.
Biological Assay
IC50
0.900±n/a nM
Citation
 Alcazar, JAmeriks, MKBerry, CBGarcia-Reynaga, PSamant, AVVega-Ramiro, JA Azaspirocycles as monoacylglycerol lipase modulators US Patent  US11505546 Publication Date 11/22/2022 
Target
Name:
Monoglyceride lipase
Synonyms:
HU-K5 Lysophospholipase-like MGL MGLL_HUMAN
Type:
Hydrolase
Mol. Mass.:
33264.56
Organism:
Homo sapiens (Human)
Description:
Human recombinant MGL (Cayman Chemical, cat# 10008354).
Residue:
303
  
Inhibitor
Name:
BDBM581654
Synonyms:
(2s,4s)-2-(6-Cyclohexyl-2-azaspiro[3.3]heptane-2-carbonyl)-7-oxa-5- azaspiro[3.4]octan-6-one | US11505546, Example 69
Type:
Small organic molecule
Emp. Form.:
C19H28N2O3
Mol. Mass.:
332.4372
SMILES:
O=C([C@H]1C[C@@]2(C1)COC(=O)N2)N1CC2(CC(C2)C2CCCCC2)C1
: