Target
Replicase polyprotein 1ab
Ligand
BDBM581949
Substrate
Meas. Tech.
Enzyme inhibition assay and Ki values determination
Ki
46±n/a nM
Citation
 Srinivas, CShuo, LNihan, UMYing-Chu, CJohn, FRavikumar, JM., MMTimothy, PZhifeng, YW., YD CORONAVIRUS MAIN PROTEASE INHIBITORS AND METHODS USING SAME WIPO 0:0 (2023) Target
Name:
Replicase polyprotein 1ab
Synonyms:
ORF1ab polyprotein pp1ab | rep
Type:
Protein
Mol. Mass.:
794070.71
Organism:
2019-nCoV
Description:
P0DTD1
Residue:
7096
  
Inhibitor
Name:
BDBM581949
Synonyms:
WO2023004291, Compound CDD-1829
Type:
Small organic molecule
Emp. Form.:
C32H28F3N5O2
Mol. Mass.:
571.5922
SMILES:
CNC(=O)[C@H]1C[C@@H](C1)n1c(nc2cccc(C(=O)N[C@@H](C)c3ccc(cc3)C(F)(F)F)c12)-c1cncc2ccccc12
: