Target
Advanced glycosylation end product-specific receptor
Ligand
BDBM582522
Substrate
Meas. Tech.
Microscale Thermophoresis Assay
Kd
9.70±n/a nM
Citation
 Banner, WKGaddam, BPolisetti, DRAndrews, RCVictory, S Metabolites of [3-(4-{2-butyl-1-[4-(4-chloro-phenoxy)-phenyl]-1H-imidazol-4 yl}-phenoxy)-propyl]-diethyl-amine US Patent  US11524942 Publication Date 12/13/2022 
Target
Name:
Advanced glycosylation end product-specific receptor
Synonyms:
AGER RAGE_HUMAN | Receptor for advanced glycosylation end products
Type:
PROTEIN
Mol. Mass.:
42800.11
Organism:
Homo sapiens (Human)
Description:
ChEMBL_1339877
Residue:
404
  
Inhibitor
Name:
BDBM582522
Synonyms:
US11524942, Compound M5
Type:
Small organic molecule
Emp. Form.:
C32H38ClN3O3
Mol. Mass.:
548.115
SMILES:
CCCCc1nc(cn1-c1ccc(Oc2ccc(Cl)cc2O)cc1)-c1ccc(OCCCN(CC)CC)cc1
: