Target
Cytochrome P450 11B1, mitochondrial
Ligand
BDBM8876
Substrate
BDBM8582
Meas. Tech.
CYP11B Assay
pH
7.4±n/a
Temperature
310.15±n/a K
IC50
15.0±n/a nM
Citation
 Ulmschneider, SMuller-Vieira, UMitrenga, MHartmann, RWOberwinkler-Marchais, SKlein, CDBureik, MBernhardt, RAntes, ILengauer, T Synthesis and evaluation of imidazolylmethylenetetrahydronaphthalenes and imidazolylmethyleneindanes: potent inhibitors of aldosterone synthase. J Med Chem 48:1796-805 (2005)  
Target
Name:
Cytochrome P450 11B1, mitochondrial
Synonyms:
C11B1_HUMAN CYPXIB1 Cytochrome P450 11B1 Cytochrome P450 11B1, mitochondrial | S11BH
Type:
Enzyme
Mol. Mass.:
57591.44
Organism:
Homo sapiens (Human)
Description:
P15538
Residue:
503
  
Inhibitor
Name:
BDBM8876
Synonyms:
(1E)-1-(1H-Imidazol-5-ylmethylene)indane-5-carbonitrile Imidazolylmethyleneindane 5a | Imidazolylmethyleneindane 5b
Type:
Small organic molecule
Emp. Form.:
C14H11N3
Mol. Mass.:
221.2572
SMILES:
N#Cc1ccc2C(CCc2c1)=Cc1cnc[nH]1
:
Substrate
Name:
BDBM8582
Synonyms:
(1S,2R,10S,11S,14S,15S)-14-(2-hydroxyacetyl)-2,15-dimethyltetracyclo[8.7.0.0^{2,7}.0^{11,15}]heptadec-6-en-5-one 21-hydroxypregn-4-ene-3,20-dione [4-14C]-11-deoxycorticosterone | deoxycorticosterone
Type:
Small organic molecule
Emp. Form.:
C21H30O3
Mol. Mass.:
330.4611
SMILES:
[H][C@@]12CC[C@H](C(=O)CO)[C@@]1(C)CC[C@@]1([H])[C@@]2([H])CCC2=CC(=O)CC[C@]12C
: