Target
Phosphatidylinositol 4-phosphate 3-kinase C2 domain-containing subunit alpha
Ligand
BDBM50342298
Substrate
Meas. Tech.
Kinase Assay
IC50
1.60±n/a nM
Citation
 Xu, HChen, XLin, SJi, MJin, JWu, DWang, CLv, Y Quinazoline compounds, preparation method, use, and pharmaceutical composition thereof US Patent  US11534443 Publication Date 12/27/2022 
Target
Name:
Phosphatidylinositol 4-phosphate 3-kinase C2 domain-containing subunit alpha
Synonyms:
P3C2A_HUMAN PIK3C2A Phosphatidylinositol-4-phosphate 3-kinase C2 domain-containing subunit alpha PtdIns-3-kinase C2 subunit alpha
Type:
Protein
Mol. Mass.:
190704.50
Organism:
Homo sapiens (Human)
Description:
O00443
Residue:
1686
  
Inhibitor
Name:
BDBM50342298
Synonyms:
CHEMBL4159325 | US11534443, Example 25
Type:
Small organic molecule
Emp. Form.:
C24H23F2N5O5S
Mol. Mass.:
531.532
SMILES:
COCCOc1cc(cc2c(C)nc(N)nc12)-c1cnc(OC)c(NS(=O)(=O)c2ccc(F)cc2F)c1
: