Target
Phosphatidylinositol 4-phosphate 3-kinase C2 domain-containing subunit alpha
Ligand
BDBM50342299
Substrate
Meas. Tech.
Kinase Assay
IC50
1.70±n/a nM
Citation
 Xu, HChen, XLin, SJi, MJin, JWu, DWang, CLv, Y Quinazoline compounds, preparation method, use, and pharmaceutical composition thereof US Patent  US11534443 Publication Date 12/27/2022 
Target
Name:
Phosphatidylinositol 4-phosphate 3-kinase C2 domain-containing subunit alpha
Synonyms:
P3C2A_HUMAN PIK3C2A Phosphatidylinositol-4-phosphate 3-kinase C2 domain-containing subunit alpha PtdIns-3-kinase C2 subunit alpha
Type:
Protein
Mol. Mass.:
190704.50
Organism:
Homo sapiens (Human)
Description:
O00443
Residue:
1686
  
Inhibitor
Name:
BDBM50342299
Synonyms:
CHEMBL4169963 | US11534443, Example 27
Type:
Small organic molecule
Emp. Form.:
C25H23F2N5O4S
Mol. Mass.:
527.543
SMILES:
COc1ncc(cc1NS(=O)(=O)c1ccc(F)cc1F)-c1cc(OCC2CC2)c2nc(N)nc(C)c2c1
: