Target
Tyrosine-protein kinase Mer [557-882,H628Q,R794A]
Ligand
BDBM588246
Substrate
Meas. Tech.
Mer Kinase Assay
IC50
<10±n/a nM
Citation
 Bannen, LCBui, MJiang, FTso, KWang, YXu, W Compounds for the treatment of kinase-dependent disorders US Patent  US11542259 Publication Date 1/3/2023 
Target
Name:
Tyrosine-protein kinase Mer [557-882,H628Q,R794A]
Synonyms:
MER MERTK_HUMAN | Tyrosine-protein kinase Mer (557-882)(H628Q)(R794A)
Type:
Mol. Mass.:
37500.46
Organism:
Tyrosine-protein kinase Mer
Description:
Q12866[557-882,H628Q,R794A]
Residue:
326
  
Inhibitor
Name:
BDBM588246
Synonyms:
US11542259, Compound 150 | methyl 4-[4-[[1-[(4- fluorophenyl)carbamoyl]- cyclopropanecarbonyl]- amino]phenoxy]- 6-methoxyquinoline-7- carboxylate
Type:
Small organic molecule
Emp. Form.:
C29H24FN3O6
Mol. Mass.:
529.5158
SMILES:
COC(=O)c1cc2nccc(Oc3ccc(NC(=O)C4(CC4)C(=O)Nc4ccc(F)cc4)cc3)c2cc1OC
: