Target
Hepatocyte growth factor receptor MET Isoform 2 [974-1390,A1209G,V1290L]
Ligand
BDBM588246
Substrate
Meas. Tech.
Met Kinase Assay
IC50
<10±n/a nM
Citation
 Bannen, LCBui, MJiang, FTso, KWang, YXu, W Compounds for the treatment of kinase-dependent disorders US Patent  US11542259 Publication Date 1/3/2023 
Target
Name:
Hepatocyte growth factor receptor MET Isoform 2 [974-1390,A1209G,V1290L]
Synonyms:
Hepatocyte growth factor receptor MET (974-1390)(A1209G)(V1290L) MET_HUMAN
Type:
Mol. Mass.:
47001.54
Organism:
Homo sapiens (Human)
Description:
P08581-2[974-1390,A1209G,V1290L]
Residue:
417
  
Inhibitor
Name:
BDBM588246
Synonyms:
US11542259, Compound 150 | methyl 4-[4-[[1-[(4- fluorophenyl)carbamoyl]- cyclopropanecarbonyl]- amino]phenoxy]- 6-methoxyquinoline-7- carboxylate
Type:
Small organic molecule
Emp. Form.:
C29H24FN3O6
Mol. Mass.:
529.5158
SMILES:
COC(=O)c1cc2nccc(Oc3ccc(NC(=O)C4(CC4)C(=O)Nc4ccc(F)cc4)cc3)c2cc1OC
: