Target
Hepatocyte growth factor receptor MET Isoform 2 [974-1390,A1209G,V1290L]
Ligand
BDBM588248
Substrate
Meas. Tech.
Met Kinase Assay
IC50
<10±n/a nM
Citation
 Bannen, LCBui, MJiang, FTso, KWang, YXu, W Compounds for the treatment of kinase-dependent disorders US Patent  US11542259 Publication Date 1/3/2023 
Target
Name:
Hepatocyte growth factor receptor MET Isoform 2 [974-1390,A1209G,V1290L]
Synonyms:
Hepatocyte growth factor receptor MET (974-1390)(A1209G)(V1290L) MET_HUMAN
Type:
Mol. Mass.:
47001.54
Organism:
Homo sapiens (Human)
Description:
P08581-2[974-1390,A1209G,V1290L]
Residue:
417
  
Inhibitor
Name:
BDBM588248
Synonyms:
1-N-[4-(7-carbamoyl-6- methoxyquinolin-4- yl)oxyphenyl]-1-N'-(4- fluorophenyl)cyclopropane- 1,1-dicarboxamide | US11542259, Compound 152
Type:
Small organic molecule
Emp. Form.:
C28H23FN4O5
Mol. Mass.:
514.5044
SMILES:
COc1cc2c(Oc3ccc(NC(=O)C4(CC4)C(=O)Nc4ccc(F)cc4)cc3)ccnc2cc1C(N)=O
: