Target
Tyrosine-protein kinase Mer [557-882,H628Q,R794A]
Ligand
BDBM588250
Substrate
Meas. Tech.
Mer Kinase Assay
IC50
<10±n/a nM
Citation
 Bannen, LCBui, MJiang, FTso, KWang, YXu, W Compounds for the treatment of kinase-dependent disorders US Patent  US11542259 Publication Date 1/3/2023 
Target
Name:
Tyrosine-protein kinase Mer [557-882,H628Q,R794A]
Synonyms:
MER MERTK_HUMAN | Tyrosine-protein kinase Mer (557-882)(H628Q)(R794A)
Type:
Mol. Mass.:
37500.46
Organism:
Tyrosine-protein kinase Mer
Description:
Q12866[557-882,H628Q,R794A]
Residue:
326
  
Inhibitor
Name:
BDBM588250
Synonyms:
US11542259, Compound 162 | methyl 4-[4-[[1-[(4- fluorophenyl)carbamoyl]- cyclopropanecarbonyl]- amino]phenoxy]- quinoline-7-carboxylate
Type:
Small organic molecule
Emp. Form.:
C28H22FN3O5
Mol. Mass.:
499.4898
SMILES:
COC(=O)c1ccc2c(Oc3ccc(NC(=O)C4(CC4)C(=O)Nc4ccc(F)cc4)cc3)ccnc2c1
: