Target
Tyrosine-protein kinase receptor UFO [473-894,Q764R]
Ligand
BDBM588252
Substrate
Meas. Tech.
AXL Kinase Assay
IC50
<10±n/a nM
Citation
 Bannen, LCBui, MJiang, FTso, KWang, YXu, W Compounds for the treatment of kinase-dependent disorders US Patent  US11542259 Publication Date 1/3/2023 
Target
Name:
Tyrosine-protein kinase receptor UFO [473-894,Q764R]
Synonyms:
AXL UFO | UFO_HUMAN
Type:
Mol. Mass.:
47245.78
Organism:
Homo sapiens (Human)
Description:
P30530[473-894,Q764R]
Residue:
422
  
Inhibitor
Name:
BDBM588252
Synonyms:
1-N-[4-(7-carbamoylquinolin- 4-yl)oxyphenyl]-1-N'-(4- fluorophenyl)cyclopropane- 1,1-dicarboxamide | US11542259, Compound 164
Type:
Small organic molecule
Emp. Form.:
C27H21FN4O4
Mol. Mass.:
484.4784
SMILES:
NC(=O)c1ccc2c(Oc3ccc(NC(=O)C4(CC4)C(=O)Nc4ccc(F)cc4)cc3)ccnc2c1
: