Target
Tyrosine-protein kinase receptor UFO [473-894,Q764R]
Ligand
BDBM588253
Substrate
Meas. Tech.
AXL Kinase Assay
IC50
<10±n/a nM
Citation
 Bannen, LCBui, MJiang, FTso, KWang, YXu, W Compounds for the treatment of kinase-dependent disorders US Patent  US11542259 Publication Date 1/3/2023 
Target
Name:
Tyrosine-protein kinase receptor UFO [473-894,Q764R]
Synonyms:
AXL UFO | UFO_HUMAN
Type:
Mol. Mass.:
47245.78
Organism:
Homo sapiens (Human)
Description:
P30530[473-894,Q764R]
Residue:
422
  
Inhibitor
Name:
BDBM588253
Synonyms:
1-N'-(4-fluorophenyl)-1-N-[4- [7-(methylcarbamoyl)quinolin- 4-yl]oxyphenyl]cyclopropane- 1,1-dicarboxamide | US11542259, Compound 165
Type:
Small organic molecule
Emp. Form.:
C28H23FN4O4
Mol. Mass.:
498.505
SMILES:
CNC(=O)c1ccc2c(Oc3ccc(NC(=O)C4(CC4)C(=O)Nc4ccc(F)cc4)cc3)ccnc2c1
: