Target
Hepatocyte growth factor receptor MET Isoform 2 [974-1390,A1209G,V1290L]
Ligand
BDBM588261
Substrate
Meas. Tech.
Met Kinase Assay
IC50
<10±n/a nM
Citation
 Bannen, LCBui, MJiang, FTso, KWang, YXu, W Compounds for the treatment of kinase-dependent disorders US Patent  US11542259 Publication Date 1/3/2023 
Target
Name:
Hepatocyte growth factor receptor MET Isoform 2 [974-1390,A1209G,V1290L]
Synonyms:
Hepatocyte growth factor receptor MET (974-1390)(A1209G)(V1290L) MET_HUMAN
Type:
Mol. Mass.:
47001.54
Organism:
Homo sapiens (Human)
Description:
P08581-2[974-1390,A1209G,V1290L]
Residue:
417
  
Inhibitor
Name:
BDBM588261
Synonyms:
1-N'-(4-fluorophenyl)-1-N- [4-[7-methoxy-6-(1H-pyrazol- 5-yl)quinolin-4- yl]oxyphenyl]cyclopropane- 1,1-dicarboxamide | US11542259, Compound 185
Type:
Small organic molecule
Emp. Form.:
C30H24FN5O4
Mol. Mass.:
537.5411
SMILES:
COc1cc2nccc(Oc3ccc(NC(=O)C4(CC4)C(=O)Nc4ccc(F)cc4)cc3)c2cc1-c1ccn[nH]1
: