Target
Tyrosine-protein kinase Mer [557-882,H628Q,R794A]
Ligand
BDBM588262
Substrate
Meas. Tech.
Mer Kinase Assay
IC50
<10±n/a nM
Citation
 Bannen, LCBui, MJiang, FTso, KWang, YXu, W Compounds for the treatment of kinase-dependent disorders US Patent  US11542259 Publication Date 1/3/2023 
Target
Name:
Tyrosine-protein kinase Mer [557-882,H628Q,R794A]
Synonyms:
MER MERTK_HUMAN | Tyrosine-protein kinase Mer (557-882)(H628Q)(R794A)
Type:
Mol. Mass.:
37500.46
Organism:
Tyrosine-protein kinase Mer
Description:
Q12866[557-882,H628Q,R794A]
Residue:
326
  
Inhibitor
Name:
BDBM588262
Synonyms:
1-N'-(4-fluorophenyl)-1-N- [4-[7-methoxy-6- (1H-pyrazol-4- yl)quinolin-4- yl]oxyphenyl]cyclopropane- 1,1-dicarboxamide | US11542259, Compound 186
Type:
Small organic molecule
Emp. Form.:
C30H24FN5O4
Mol. Mass.:
537.5411
SMILES:
COc1cc2nccc(Oc3ccc(NC(=O)C4(CC4)C(=O)Nc4ccc(F)cc4)cc3)c2cc1-c1cn[nH]c1
: