Target
Tyrosine-protein kinase receptor UFO [473-894,Q764R]
Ligand
BDBM588271
Substrate
Meas. Tech.
AXL Kinase Assay
IC50
<10±n/a nM
Citation
 Bannen, LCBui, MJiang, FTso, KWang, YXu, W Compounds for the treatment of kinase-dependent disorders US Patent  US11542259 Publication Date 1/3/2023 
Target
Name:
Tyrosine-protein kinase receptor UFO [473-894,Q764R]
Synonyms:
AXL UFO | UFO_HUMAN
Type:
Mol. Mass.:
47245.78
Organism:
Homo sapiens (Human)
Description:
P30530[473-894,Q764R]
Residue:
422
  
Inhibitor
Name:
BDBM588271
Synonyms:
1-N'-(4-fluorophenyl)-1-N-[4-(7- methoxy-6-pyridin-3-ylquinolin- 4-yl)oxyphenyl]cyclopropane- 1,1-dicarboxamide | US11542259, Compound 201
Type:
Small organic molecule
Emp. Form.:
C32H25FN4O4
Mol. Mass.:
548.5637
SMILES:
COc1cc2nccc(Oc3ccc(NC(=O)C4(CC4)C(=O)Nc4ccc(F)cc4)cc3)c2cc1-c1cccnc1
: