Target
Phosphatidylinositol 4,5-bisphosphate 3-kinase catalytic subunit gamma isoform
Ligand
BDBM119531
Substrate
Meas. Tech.
Inhibition Assay of PI3K
IC50
<10000±n/a nM
Citation
 Ren, PLiu, YLi, LChan, KWilson, TECampbell, SF Heterocyclic compounds and uses thereof US Patent  US11547697 Publication Date 1/10/2023 
Target
Name:
Phosphatidylinositol 4,5-bisphosphate 3-kinase catalytic subunit gamma isoform
Synonyms:
PI3-kinase p110 subunit gamma PI3Kgamma PK3CG_HUMAN Phosphatidylinositol 4,5-bisphosphate 3-kinase (PI3K) Phosphatidylinositol 4,5-bisphosphate 3-kinase catalytic subunit gamma (PI3Kgamma) Phosphatidylinositol 4,5-bisphosphate 3-kinase catalytic subunit gamma isoform (PI3K) Phosphatidylinositol-4,5-bisphosphate 3-kinase catalytic subunit gamma isoform Phosphoinositide 3-kinases gamma (PI3K gamma) p120-PI3K
Type:
Enzyme Subunit
Mol. Mass.:
126470.30
Organism:
Homo sapiens (Human)
Description:
P48736
Residue:
1102
  
Inhibitor
Name:
BDBM119531
Synonyms:
US11547697, Compound 529 US9682141, 54
Type:
Small organic molecule
Emp. Form.:
C19H17N5O3
Mol. Mass.:
363.37
SMILES:
Nc1nc2cc(ccc2o1)-c1ccc2ncc(C(=O)N3CCOCC3)n2c1
: