Target
Proto-oncogene tyrosine-protein kinase receptor Ret [V804M]
Ligand
BDBM488448
Substrate
Meas. Tech.
Enzyme Assay
IC50
27.8±n/a nM
Citation
 Jordan, AMNewton, RWaszkowycz, BSutton, JMHynd, GPaoletta, SFordyce, EA Heterocyclic compounds as RET kinase inhibitors US Patent  US11548896 Publication Date 1/10/2023 
Target
Name:
Proto-oncogene tyrosine-protein kinase receptor Ret [V804M]
Synonyms:
CDHF12 PTC RET RET51 ret enzyme (v804m)
Type:
Enzyme Catalytic Domain
Mol. Mass.:
124350.36
Organism:
Homo sapiens (Human)
Description:
P07949[V804M]
Residue:
1114
  
Inhibitor
Name:
BDBM488448
Synonyms:
2-{4-Amino-1-tert-butyl-1H-pyrazolo[3,4- d]pyrimidin-3-yl}-3-chloro-N-(1,3-thiazol-2-yl)-1H- indole-6-carboxamide US11548896, Example 88
Type:
Small organic molecule
Emp. Form.:
C21H19ClN8OS
Mol. Mass.:
466.947
SMILES:
CC(C)(C)n1nc(-c2[nH]c3cc(ccc3c2Cl)C(=O)Nc2nccs2)c2c(N)ncnc12
: