Target
Dipeptidyl peptidase 9
Ligand
BDBM50050525
Substrate
Meas. Tech.
EnPlex (purified enzyme activity assay)
IC50
3.10±n/a nM
Citation
 Bachovchin, WWLai, HWu, W Combination therapies using caspase-1 dependent anticancer agents and PGE2 antagonists US Patent  US11559537 Publication Date 1/24/2023 
Target
Name:
Dipeptidyl peptidase 9
Synonyms:
DPP9 DPRP-2 Dipeptidyl peptidase 9 (DDP9) Dipeptidyl peptidase 9 (DPP9) Dipeptidyl peptidase IX Dipeptidyl peptidase-like protein 9
Type:
Enzyme
Mol. Mass.:
98260.70
Organism:
Homo sapiens (Human)
Description:
Q86TI2
Residue:
863
  
Inhibitor
Name:
BDBM50050525
Synonyms:
(R)-1-((S)-2-aminopropanoyl)pyrrolidin-2-ylboronic acid CHEMBL63860 US11559537, Compound 1129 US8933056, Asp-boroPro
Type:
Small organic molecule
Emp. Form.:
C7H15BN2O3
Mol. Mass.:
186.017
SMILES:
C[C@H](N)C(=O)N1CCC[C@H]1B(O)O
: