Target
Dipeptidyl peptidase 9
Ligand
BDBM142088
Substrate
Meas. Tech.
EnPlex (purified enzyme activity assay)
IC50
2.80±n/a nM
Citation
 Bachovchin, WWLai, HWu, W Combination therapies using caspase-1 dependent anticancer agents and PGE2 antagonists US Patent  US11559537 Publication Date 1/24/2023 
Target
Name:
Dipeptidyl peptidase 9
Synonyms:
DPP9 DPRP-2 Dipeptidyl peptidase 9 (DDP9) Dipeptidyl peptidase 9 (DPP9) Dipeptidyl peptidase IX Dipeptidyl peptidase-like protein 9
Type:
Enzyme
Mol. Mass.:
98260.70
Organism:
Homo sapiens (Human)
Description:
Q86TI2
Residue:
863
  
Inhibitor
Name:
BDBM142088
Synonyms:
US11096924, DASH-inhibitors 2243 US8933056, Ala-boroPro Thioxamide
Type:
Small organic molecule
Emp. Form.:
C7H15BN2O2S
Mol. Mass.:
202.082
SMILES:
C[C@H](N)C(=S)N1CCC[C@H]1B(O)O
: