Target
Dipeptidyl peptidase 9
Ligand
BDBM514532
Substrate
Meas. Tech.
EnPlex (purified enzyme activity assay)
IC50
7.00±n/a nM
Citation
 Bachovchin, WWLai, HWu, W Combination therapies using caspase-1 dependent anticancer agents and PGE2 antagonists US Patent  US11559537 Publication Date 1/24/2023 
Target
Name:
Dipeptidyl peptidase 9
Synonyms:
DPP9 DPRP-2 Dipeptidyl peptidase 9 (DDP9) Dipeptidyl peptidase 9 (DPP9) Dipeptidyl peptidase IX Dipeptidyl peptidase-like protein 9
Type:
Enzyme
Mol. Mass.:
98260.70
Organism:
Homo sapiens (Human)
Description:
Q86TI2
Residue:
863
  
Inhibitor
Name:
BDBM514532
Synonyms:
US11096924, DASH-inhibitors 3102 A | US11583516, Cmpd ID 3102A
Type:
Small organic molecule
Emp. Form.:
C16H27BN2O4
Mol. Mass.:
322.208
SMILES:
N[C@H](C(=O)N1CCC[C@H]1B(O)O)C12CC3CC(CC(O)(C3)C1)C2
: