Target
Dipeptidyl peptidase 9
Ligand
BDBM514554
Substrate
Meas. Tech.
EnPlex (purified enzyme activity assay)
IC50
5.20±n/a nM
Citation
 Bachovchin, WWLai, HWu, W Combination therapies using caspase-1 dependent anticancer agents and PGE2 antagonists US Patent  US11559537 Publication Date 1/24/2023 
Target
Name:
Dipeptidyl peptidase 9
Synonyms:
DPP9 DPRP-2 Dipeptidyl peptidase 9 (DDP9) Dipeptidyl peptidase 9 (DPP9) Dipeptidyl peptidase IX Dipeptidyl peptidase-like protein 9
Type:
Enzyme
Mol. Mass.:
98260.70
Organism:
Homo sapiens (Human)
Description:
Q86TI2
Residue:
863
  
Inhibitor
Name:
BDBM514554
Synonyms:
US11096924, DASH-inhibitors 5363 | US11583516, Cmpd ID 5363
Type:
Small organic molecule
Emp. Form.:
C11H21BN2O3
Mol. Mass.:
240.107
SMILES:
CC1(C)CCN[C@@H]1C(=O)N1CCC[C@H]1B(O)O
: