Target
Dipeptidyl peptidase 9
Ligand
BDBM514516
Substrate
Meas. Tech.
In Vitro Inhibition Assay
IC50
2.70±n/a nM
Citation
 Bachovchin, WWLai, HWu, W Dash inhibitors, and uses related thereto US Patent  US11583516 Publication Date 2/21/2023 
Target
Name:
Dipeptidyl peptidase 9
Synonyms:
DPP9 DPRP-2 Dipeptidyl peptidase 9 (DDP9) Dipeptidyl peptidase 9 (DPP9) Dipeptidyl peptidase IX Dipeptidyl peptidase-like protein 9
Type:
Enzyme
Mol. Mass.:
98260.70
Organism:
Homo sapiens (Human)
Description:
Q86TI2
Residue:
863
  
Inhibitor
Name:
BDBM514516
Synonyms:
US11096924, DASH-inhibitors 4175 CH | US11583516, Cmpd ID 4175CH
Type:
Small organic molecule
Emp. Form.:
C13H25BN2O3
Mol. Mass.:
268.16
SMILES:
CC1(CCCCC1)[C@H](N)C(=O)N1CCC[C@H]1B(O)O
: