Target
Diacylglycerol kinase zeta
Ligand
BDBM594283
Substrate
Meas. Tech.
In Vitro DGK Inhibition Assay
IC50
14.0±n/a nM
Citation
 Velaparthi, UOlson, REDarne, CPDasgupta, BWarrier, JSRahaman, HJalagam, PRRoy, SGrunenfelder, DC Substituted pyridopyrimidinonyl compounds useful as T cell activators US Patent  US11584747 Publication Date 2/21/2023 
Target
Name:
Diacylglycerol kinase zeta
Synonyms:
2.7.1.107 DAGK6 DGKZ Diacylglycerol kinase zeta | Diglyceride kinase zeta
Type:
PROTEIN
Mol. Mass.:
124177.85
Organism:
Homo sapiens
Description:
ChEMBL_117547
Residue:
1117
  
Inhibitor
Name:
BDBM594283
Synonyms:
US11584747, Example 77 | US11584747, Example 78
Type:
Small organic molecule
Emp. Form.:
C26H30F2N6O2
Mol. Mass.:
496.5522
SMILES:
CCC(N1C[C@H](C)N(C[C@H]1CC)c1nc(=O)n(C)c2ccc(nc12)C#N)c1ccc(OC(F)F)cc1
: