Target
Diacylglycerol kinase zeta
Ligand
BDBM594430
Substrate
Meas. Tech.
In Vitro DGK Inhibition Assay
IC50
13.0±n/a nM
Citation
 Velaparthi, UOlson, REDarne, CPDasgupta, BWarrier, JSRahaman, HJalagam, PRRoy, SGrunenfelder, DC Substituted pyridopyrimidinonyl compounds useful as T cell activators US Patent  US11584747 Publication Date 2/21/2023 
Target
Name:
Diacylglycerol kinase zeta
Synonyms:
2.7.1.107 DAGK6 DGKZ Diacylglycerol kinase zeta | Diglyceride kinase zeta
Type:
PROTEIN
Mol. Mass.:
124177.85
Organism:
Homo sapiens
Description:
ChEMBL_117547
Residue:
1117
  
Inhibitor
Name:
BDBM594430
Synonyms:
US11584747, Example 232 | US11584747, Example 233
Type:
Small organic molecule
Emp. Form.:
C27H31F3N6O2
Mol. Mass.:
528.5692
SMILES:
CCC(N1C[C@H](CC)N(C[C@H]1CC)c1nc(=O)n(C)c2ccc(nc12)C#N)c1ccc(OC(F)F)cc1F
: