Target
Diacylglycerol kinase zeta
Ligand
BDBM594506
Substrate
Meas. Tech.
In Vitro DGK Inhibition Assay
IC50
4.00±n/a nM
Citation
 Velaparthi, UOlson, REDarne, CPDasgupta, BWarrier, JSRahaman, HJalagam, PRRoy, SGrunenfelder, DC Substituted pyridopyrimidinonyl compounds useful as T cell activators US Patent  US11584747 Publication Date 2/21/2023 
Target
Name:
Diacylglycerol kinase zeta
Synonyms:
2.7.1.107 DAGK6 DGKZ Diacylglycerol kinase zeta | Diglyceride kinase zeta
Type:
PROTEIN
Mol. Mass.:
124177.85
Organism:
Homo sapiens
Description:
ChEMBL_117547
Residue:
1117
  
Inhibitor
Name:
BDBM594506
Synonyms:
US11584747, Example 313 | US11584747, Example 314
Type:
Small organic molecule
Emp. Form.:
C27H34N6O2
Mol. Mass.:
474.5979
SMILES:
CC[C@@H]1CN([C@@H](C)CN1C(C(C)C)c1ccc(OC)cc1)c1nc(=O)n(C)c2ccc(nc12)C#N
: