Target
Tyrosine-protein kinase JAK1
Ligand
BDBM246883
Substrate
Meas. Tech.
In Vitro JAK Kinase Assay
IC50
<10±n/a nM
Citation
 Yeleswaram, KSmith, PHollis, GF JAK1 pathway inhibitors for the treatment of gastrointestinal disease US Patent  US11596632 Publication Date 3/7/2023 
Target
Name:
Tyrosine-protein kinase JAK1
Synonyms:
JAK-1 JAK1A JAK1_HUMAN Janus kinase 1 (JAK1) | Janus kinase 1 JAK1
Type:
Protein
Mol. Mass.:
133293.73
Organism:
Homo sapiens (Human)
Description:
P23458
Residue:
1154
  
Inhibitor
Name:
BDBM246883
Synonyms:
US10005788, 1 (2nd peak, cis-) US10065963, Compound 22 US10336759, # 22 US10519163, Example 22 US11084822, Example 22 US11136326, Example 22 US11324749, Comp. No. 22 US11596632, Comp. No. 22 US9732097, Example 22 | {1-(cis-4-{[4-{[(3S)- 3-hydroxypyrrolidin- 1-yl]methyl}-6- (trifluoromethyl) pyridin-2- yl]oxy}cyclohexyl)- 3-[4-(7H-pyrrolo[2,3- d]pyrimidin-4-yl)- 1H-pyrazol-1- yl]azetidin-3- yl jacetonitrile
Type:
Small organic molecule
Emp. Form.:
C31H34F3N9O2
Mol. Mass.:
621.656
SMILES:
O[C@H]1CCN(Cc2cc(O[C@H]3CC[C@H](CC3)N3CC(CC#N)(C3)n3cc(cn3)-c3ncnc4[nH]ccc34)nc(c2)C(F)(F)F)C1
: