Target
Tyrosine-protein kinase JAK1
Ligand
BDBM246884
Substrate
Meas. Tech.
In Vitro JAK Kinase Assay
IC50
<10±n/a nM
Citation
 Yeleswaram, KSmith, PHollis, GF JAK1 pathway inhibitors for the treatment of gastrointestinal disease US Patent  US11596632 Publication Date 3/7/2023 
Target
Name:
Tyrosine-protein kinase JAK1
Synonyms:
JAK-1 JAK1A JAK1_HUMAN Janus kinase 1 (JAK1) | Janus kinase 1 JAK1
Type:
Protein
Mol. Mass.:
133293.73
Organism:
Homo sapiens (Human)
Description:
P23458
Residue:
1154
  
Inhibitor
Name:
BDBM246884
Synonyms:
US10053465, 23 US10125150, Example 23 US10479803, Example 23 US10675284, Example 23 US11130767, # 23 US11304949, Compound 23 US11406640, Comp. No. 23 US20240058343, Compound 23 {trans-3-(4-{[4- ({[(1S)-2-hydroxy-1- methylethyl]amino} methyl)-6- (trifluoromethyl) pyridin-2- yl]oxy}piperidin-1- yl)-1-[4-(7H- pyrrolo[2,3- d]pyrimidin-4-yl)- 1H-pyrazol-1- yl]cyclobutyl} acetonitrile
Type:
Small organic molecule
Emp. Form.:
C30H34F3N9O2
Mol. Mass.:
609.6453
SMILES:
C[C@@H](CO)NCc1cc(OC2CCN(CC2)[C@H]2C[C@@](CC#N)(C2)n2cc(cn2)-c2ncnc3[nH]ccc23)nc(c1)C(F)(F)F
: