Target
Polyunsaturated fatty acid lipoxygenase ALOX15
Ligand
BDBM597789
Substrate
Meas. Tech.
LOX Enzyme Activity Assay
IC50
740±n/a nM
Citation
 Springer, CMarais, RNiculescu-Duvaz, DLeung, LSmithen, DCallens, CTang, H Methylamine derivatives as lysysl oxidase inhibitors for the treatment of cancer US Patent  US11608330 Publication Date 3/21/2023 
Target
Name:
Polyunsaturated fatty acid lipoxygenase ALOX15
Synonyms:
12-LOX 15-LOX Arachidonate 12-lipoxygenase Arachidonate omega-6 lipoxygenase LOX15_PIG
Type:
PROTEIN
Mol. Mass.:
74999.86
Organism:
Sus scrofa
Description:
ChEMBL_1510008
Residue:
663
  
Inhibitor
Name:
BDBM597789
Synonyms:
US11608330, Example 50
Type:
Small organic molecule
Emp. Form.:
C13H15N3O4S2
Mol. Mass.:
341.406
SMILES:
NCc1ncc(s1)S(=O)(=O)c1cccc(c1)C(=O)NCCO
: