Target
Polyunsaturated fatty acid lipoxygenase ALOX15
Ligand
BDBM469005
Substrate
Meas. Tech.
LOX Enzyme Activity Assay
IC50
340±n/a nM
Citation
 Springer, CMarais, RNiculescu-Duvaz, DLeung, LSmithen, DCallens, CTang, H Methylamine derivatives as lysysl oxidase inhibitors for the treatment of cancer US Patent  US11608330 Publication Date 3/21/2023 
Target
Name:
Polyunsaturated fatty acid lipoxygenase ALOX15
Synonyms:
12-LOX 15-LOX Arachidonate 12-lipoxygenase Arachidonate omega-6 lipoxygenase LOX15_PIG
Type:
PROTEIN
Mol. Mass.:
74999.86
Organism:
Sus scrofa
Description:
ChEMBL_1510008
Residue:
663
  
Inhibitor
Name:
BDBM469005
Synonyms:
US10807974, Example 9 US11608330, Example 9
Type:
Small organic molecule
Emp. Form.:
C12H13NO4S3
Mol. Mass.:
331.431
SMILES:
CS(=O)(=O)c1cccc(c1)S(=O)(=O)c1ccc(CN)s1
: